"Video ID","Parent ID",Title,"Parent Title",Hours,Minutes,Seconds,Audience,Series,"Subjects (Pipe Delimted)",Publisher,"Materials (1=Yes)","CC (1=Yes)"
2,2,"Persuasive writing","Persuasive writing",0,14,59,"4 to 8","Club write","Language arts|Writing|Composition Language arts|Creative writing|","Agency for Instructional Technology  Bloomington  IN : c1999",1,0
3,3,"Descriptive Writing","Descriptive Writing",0,14,59,"4 to 8","Club write","Composition|Creative writing|Writing|Language arts|","Agency for Instructional Technology  Bloomington  IN : c1999",1,0
5,5,"Your immune system","Your immune system",0,28,3,"9 to 14",,"Human body|Immune system|Human physiology|Human anatomy|Diseases|Vaccines|Antibiotics|Study and teaching|","Films for the Humanities & Sciences  Princeton  NJ : c2001",0,0
6,6,"Aquatic biomes","Aquatic biomes",0,20,11,"9 to 13",,"Biotic communities|Life sciences|Animals|Aquatic ecology|Aquatic animals|Aquatic plants|Study and teaching|Adaptation|","Films for the Humanities & Sciences  Princeton  NJ : c2002",0,0
7,7,"Desert biomes","Desert biomes",0,17,17,"7 to 14",Biomes,"Biotic communities|Biotic communities|Desert animals|Desert ecology|Life sciences|Deserts Other|Study and teaching|","Films for the Humanities & Sciences  Princeton  NJ : c2002",1,0
8,8,"Grassland biomes","Grassland biomes",0,17,3,"7 to 14",Biomes,"Biotic communities|Grasslands|Ecology|Life sciences|Ecology Other|Study and teaching|Animals Other|","Films for the Humanities & Sciences  Princeton  NJ : c2002",0,0
9,9,"Rainforest biomes","Rainforest biomes",0,20,5,"7 to 14",Biomes,"Rain forests|Rain forest ecology|Rain forest animals|Life sciences|Ecology|Biotic communities|Study and teaching|","Films for the Humanities & Sciences  Princeton  NJ : c2002",0,0
10,10,"Tundra biomes","Tundra biomes",0,22,17,"9 to 14",Biomes,"Tundra ecology|Biotic communities|","Films for the Humanities & Sciences  Princeton  NJ : c2002",0,0
11,11,"Circulatory system the plasma pipeline","Circulatory system the plasma pipeline",0,27,37,"0 to 14","Human body systems at work","Human body|Cardiovascular system|Human physiology|Human anatomy|Study and teaching|","Films for the Humanities & Sciences  Princeton  NJ : c1999",0,0
12,12,"Digestive system your personal power plant","Digestive system your personal power plant",0,34,14,"0 to 14","Human body systems at work","Human body|Human physiology|Human anatomy|Digestion|Digestive organs|Study and teaching|","Films for the Humanities & Sciences  Princeton  NJ : c1999",0,0
13,13,"Brain and nervous system your information superhighway","Brain and nervous system your information superhighway",0,31,48,"9 to 14","Human body systems at work","Brain|Nervous system|Central nervous system|","Films for the Humanities & Sciences  Princeton  NJ : c1999",0,0
14,14,"Skeletal system the infrastructure","Skeletal system the infrastructure",0,28,2,"0 to 14","Human body systems at work","Human body|Human physiology|Human anatomy|Skeletal system|Musculoskeletal system|Study and teaching|Human Other|Skeletal structure Other|","Films for the Humanities & Sciences  Princeton  NJ : c1999",0,0
15,15,"Muscular system the inner athlete","Muscular system the inner athlete",0,24,9,"9 to 14","Human body systems at work","Human body|Human physiology|Human anatomy|Musculoskeletal system|Skin|Study and teaching|","Films for the Humanities & Sciences  Princeton  NJ : c1999",0,0
16,16,"Respiratory system intake and exhaust","Respiratory system intake and exhaust",0,19,12,"0 to 14","Human body systems at work","Human body|Human physiology|Human anatomy|Respiratory organs|Study and teaching|","Films for the Humanities & Sciences  Princeton  NJ : c1999",0,0
17,17,"The Scientific method","The Scientific method",0,22,37,"6 to 14",,Science|Science|Terminology|Methodology|,"Films for the Humanities & Sciences  Princeton  NJ : c1999",0,0
18,18,"Ultimate power evil rising","Ultimate power evil rising",0,45,0,"9 to 14",Century,"HItler Adolph|Heads of state|Biography|Germany|History|1933-1945|","Films for the Humanities & Sciences  Princeton  NJ : c1999",0,0
19,19,"Ultimate power the race","Ultimate power the race",0,45,0,"9 to 14",Century,"Twentieth century|World War 1939-1945|Atomic bomb|United States|History|20th century|","Films for the Humanities & Sciences  Princeton  NJ : c1999",0,0
20,20,"No man's land the great war.","No man's land the great war.",0,45,0,"9 to 14",Century,"United States|History|World War I|","Films for the Humanities & Sciences  Princeton  NJ : c1999",0,0
21,21,"Memphis dreams Searching for the promised land","Memphis dreams Searching for the promised land",0,33,13,"9 to 14",Century,"African Americans|African Americans|","Films for the Humanities & Sciences  Princeton  NJ : c2002",0,0
22,22,"Seeds of change","Seeds of change",0,46,3,"9 to 14","Century decades of change","Popular culture|History|20th century|United States|","Films for the Humanities & Sciences  Princeton  NJ : c1999",0,0
23,23,"1914-1919 shell shock","1914-1919 shell shock",0,46,14,"9 to 14","Century decades of change","Wilson Woodrow|Lenin Vladimir Ilich|World War 1914-1918|Nineteen tens|Personal narratives American|Personal narratives British|Personal narratives Canadian|Psychological aspects|United States|Germany|Soviet Union|Great Britain|Canada|History|Civilization|Economic conditions|Social conditions|1871-1918|Revolution 1917-1921|1865-1921|1865-1918|","Films for the Humanities & Sciences  Princeton  NJ : c1999",0,0
24,24,"1920-1929 boom to bust","1920-1929 boom to bust",0,46,18,"9 to 14","Century decades of change","Ruth Babe|Lindbergh Charles A|Byrd Richard Evelyn|World War 1914-1918|Nineteen twenties|Prohibition|Jazz|African Americans|Electric power|Radio|Women|Modernist-fundamentalist controversy|Stock exchanges|Depressions|Influence|History|Music|History and criticism|Social aspects|Suffrage|1921-1930|20th century|1929|United States|1919-1933|","Films for the Humanities & Sciences  Princeton  NJ : c1999",0,0
25,25,"1929-1936 stormy weather","1929-1936 stormy weather",0,45,52,"9 to 14","Century decades of change","Roosevelt Franklin D|Long Huey Pierce|Nineteen thirties|Depressions|Banks and banking|Stock exchanges|Motion pictures|Radio|Agriculture|Tramps|New Deal 1933-1939|Labor movement|History|1929|20th century|United States|Great Plains|Civilization|Economic conditions|Social conditions|1919-1933|1918-1945|1918-1932|","Films for the Humanities & Sciences  Princeton  NJ : c1999",0,0
26,26,"1936-1941 over the edge","1936-1941 over the edge",0,46,0,"9 to 14","Century decades of change","Roosevelt Franklin D|Hitler Adolf|Owens Jesse|Louis Joe|Anderson Marian|Nineteen thirties|National socialism|Jews|Propaganda German|Motion pictures in propaganda|Photojournalism|History|World War II|20th century|1933-1945|Germany|Austria|United States|Spain|Personal narratives|Civil War 1936-1939|","Films for the Humanities & Sciences  Princeton  NJ : c1999",0,0
27,27,"1941-1945 civilians at war","1941-1945 civilians at war",1,9,4,"9 to 14","Century decades of change","Nineteen forties|History Modern|Documentary films|National socialism|War victims|Jews|Concentration camps|Kamikaze airplanes|Propaganda Japanese|World War 1939-1945|Nuremberg Trial of Major German War Criminals Nuremberg Germany 1945-1946|Tokyo Trial Tokyo Japan 1946-1948|Sino-Japanese War 1937-1945|Personal narratives|Personal narratives Japanese|History|Propaganda|Campaigns|20th century|1933-1945|Germany|Japan|Europe|Austria|Poland|United States|Great Britain|Okinawa Island|Saint Petersburg Russia|Hiroshima-shi Japan|bombardment 1945|1926-1945|Bombardment 1945|","Films for the Humanities & Sciences  Princeton  NJ : c1999",0,0
28,28,"1953-1960 happy daze","1953-1960 happy daze",0,45,22,"9 to 14","Century decades of change","King Martin Luther|Presley Elvis|Nineteen fifties|Korean War 1950-1953|Suburbs|Consumption Economics|Television|Rock music|African Americans|Segregation in transportation|School integration|Automobiles|Cold War|Atomic bomb|Astronautics|Popular culture|History|History and criticism|Social conditions|Social aspects|20th century|to 1964|United States|Alabama|Montgomery|Arkansas|Little Rock|1953-1961|","Films for the Humanities and Sciences  Princeton  N.J. : c1999",0,0
29,29,"1960-1964 poisoned dreams","1960-1964 poisoned dreams",0,45,6,"9 to 14","Century decades of change","African Americans|Nineteen sixties|Vietnam conflict|Cuba|Foreign relations|United States|","Films for the Humanities & Sciences  Princeton  NJ : c1999",0,0
30,30,"1965-1970 unpinned","1965-1970 unpinned",0,46,9,"9 to 14","Century decades of change","King Martin Luther|King Martin Luther|Kennedy Robert F|X Malcolm|Johnson Lyndon B|Nineteen sixties|Watts Riot Los Angeles Calif 1965|Civil rights movements|African Americans|Vietnam War 1961-1975|Hippies|Personal narratives American|History|Suffrage|Personal narratives Viet Cong|Protest movements|20th century|Alabama|Selma|Mississippi|United States|Haight Ashbury San Francisco|Social conditions|1961-1969|1960-1980|","Films for the Humanities & Sciences  ; Princeton  NJ  c1999",0,0
31,31,"The Calendar how to use it.","The Calendar how to use it.",0,14,20,"1 to 4",,Calendar|,"Alfred Higgins Productions  Inc.  Los Angeles  CA : c2000",1,0
32,32,"Our flag is more than a symbol","Our flag is more than a symbol",0,14,17,"0 to 5",,"Social sciences|Flags|United States|Flag|","Alfred Higgins Productions  Inc.  Los Angeles  CA : c2002",1,0
35,35,"Animal nonfiction with Evelyn Gallardo","Animal nonfiction with Evelyn Gallardo",0,19,23,"4 to 8","Write stuff","Photography of animals|Composition Language arts|Photography|","Film Ideas  Inc.  Wheeling  IL : c2001",1,0
36,36,"Anne Frank just a diary.","Anne Frank just a diary.",0,25,15,"9 to 14",,"Frank Anne|Holocaust Jewish 1939-1945|World War 1939-1945|Concentration camps|Jews|","Filmwest Associates  Carson City  NV : c1987",0,0
37,37,Archaeology,Archaeology,0,23,18,"4 to 8","Bill Nye the science guy",Archaeology|Science|,"Disney Educational Productions  Elk Grove Village  IL. : c1997",1,0
151631,37,"Archaeology: Full Program: [Spanish] 4 Segments (23:18)",Archaeology,0,23,4,"4 to 8","Bill Nye the science guy",,,1,0
151632,37,"Segment 01: [English] Cool Scientist (06:19)",Archaeology,0,6,19,"4 to 8","Bill Nye the science guy",,,1,0
151633,37,"Segment 01: [Spanish] Cool Scientist (06:19)",Archaeology,0,6,20,"4 to 8","Bill Nye the science guy",,,1,0
151634,37,"Segment 02: [English] What Is Archaeology (04:29)",Archaeology,0,4,29,"4 to 8","Bill Nye the science guy",,,1,0
151635,37,"Segment 02: [Spanish] What Is Archaeology (04:29)",Archaeology,0,4,30,"4 to 8","Bill Nye the science guy",,,1,0
151636,37,"Segment 03: [English] Try This (07:33)",Archaeology,0,7,33,"4 to 8","Bill Nye the science guy",,,1,0
151637,37,"Segment 03: [Spanish]  Try This (07:33)",Archaeology,0,7,34,"4 to 8","Bill Nye the science guy",,,1,0
151638,37,"Segment 04: [English] Dig It Music Video (02:12)",Archaeology,0,2,12,"4 to 8","Bill Nye the science guy",,,1,0
151639,37,"Segment 04: [Spanish] Dig It Music Video (02:12)",Archaeology,0,2,11,"4 to 8","Bill Nye the science guy",,,1,0
38,38,Atoms,Atoms,0,23,37,"4 to 6","Bill Nye the science guy","Atoms|Science|Experiments|Study and teaching|","Disney Educational Productions  Elk Grove Village  IL : c1997",1,0
151640,38,"Atoms: Full Program: [Spanish] 4 Segments (23:11)",Atoms,0,23,15,"4 to 6","Bill Nye the science guy",,,1,0
151641,38,"Segment 01: [English] What Are Atoms (02:46)",Atoms,0,2,46,"4 to 6","Bill Nye the science guy",,,1,0
151642,38,"Segment 01: [Spanish] What Are Atoms (02:46)",Atoms,0,2,46,"4 to 6","Bill Nye the science guy",,,1,0
151643,38,"Segment 02: [English] Nifty Home Experiment (01:45)",Atoms,0,1,45,"4 to 6","Bill Nye the science guy",,,1,0
151644,38,"Segment 02: [Spanish] Nifty Home Experiment (01:45)",Atoms,0,1,45,"4 to 6","Bill Nye the science guy",,,1,0
151645,38,"Segment 03: [English] Way Cool Scientist (01:47)",Atoms,0,1,47,"4 to 6","Bill Nye the science guy",,,1,0
151646,38,"Segment 03: [Spanish] Way Cool Scientist (01:47)",Atoms,0,1,48,"4 to 6","Bill Nye the science guy",,,1,0
151647,38,"Segment 04: [English] Atoms In My Life Music Video (00:49)",Atoms,0,0,49,"4 to 6","Bill Nye the science guy",,,1,0
151648,38,"Segment 04: [Spanish] Atoms In My Life Music Video (00:49)",Atoms,0,0,48,"4 to 6","Bill Nye the science guy",,,1,0
39,39,Balance,Balance,0,23,45,"4 to 8","Bill Nye the science guy",Gravity|Science|,"Disney Educational Productions  Elk Grove Village  IL : c1995",1,0
51655,39,"Segment 03: [Spanish] Way Cool Scientist (01:07)",Balance,0,1,7,"4 to 8","Bill Nye the science guy",,,1,0
51656,39,"Segment 04: [English] Balance This Music Video (01:26)",Balance,0,1,26,"4 to 8","Bill Nye the science guy",,,1,0
51657,39,"Segment 04: [Spanish] Balance This Music Video (01:26)",Balance,0,1,27,"4 to 8","Bill Nye the science guy",,,1,0
151649,39,"Balance: Full Program: [Spanish] 4 Segments (23:03)",Balance,0,23,13,"4 to 8","Bill Nye the science guy",,,1,0
151650,39,"Segment 01: [English] Try This (00:56)",Balance,0,0,54,"4 to 8","Bill Nye the science guy",,,1,0
151651,39,"Segment 01: [Spanish] Try This (00:56)",Balance,0,0,54,"4 to 8","Bill Nye the science guy",,,1,0
151652,39,"Segment 02: [English] Consider the Following (01:36)",Balance,0,1,36,"4 to 8","Bill Nye the science guy",,,1,0
151653,39,"Segment 02: [Spanish] Consider the Following (01:36)",Balance,0,1,41,"4 to 8","Bill Nye the science guy",,,1,0
151654,39,"Segment 03: [English] Way Cool Scientist (01:07)",Balance,0,1,7,"4 to 8","Bill Nye the science guy",,,1,0
151655,39,"Segment 03: [Spanish] Way Cool Scientist (01:07)",Balance,0,1,7,"4 to 8","Bill Nye the science guy",,,1,0
151656,39,"Segment 04: [English] Balance This Music Video (01:26)",Balance,0,1,26,"4 to 8","Bill Nye the science guy",,,1,0
151657,39,"Segment 04: [Spanish] Balance This Music Video (01:26)",Balance,0,1,27,"4 to 8","Bill Nye the science guy",,,1,0
40,40,"Beginning math vocabulary","Beginning math vocabulary",0,11,30,"0 to 2",,"Time|Vocabulary|Value|Money|English language|Comprehension|Word recognition|Differentiation Cognition|Mathematics|Reading comprehension|Language arts Primary|Interdisciplinary approach in education|Comparison|Quantity|","100% Educational Videos El Dorado  CA  c20041998",1,0
43,43,"Blood and circulation.","Blood and circulation.",0,23,30,"4 to 9","Bill Nye the science guy",Science|Blood|Circulation|,"Disney Educational Productions  Elk Grove Village  IL : c1995",1,0
51658,43,"Blood and Circulation: Full Program: [Spanish] 4 Segments (22:57)","Blood and circulation.",0,23,1,"4 to 9","Bill Nye the science guy",,,1,0
51659,43,"Segment 01: [English] Nifty Home Experiment (00:33)","Blood and circulation.",0,0,33,"4 to 9","Bill Nye the science guy",,,1,0
51660,43,"Segment 01: [Spanish] Nifty Home Experiment (00:33)","Blood and circulation.",0,0,33,"4 to 9","Bill Nye the science guy",,,1,0
51661,43,"Segment 02: [English] Consider the Following (01:35)","Blood and circulation.",0,1,35,"4 to 9","Bill Nye the science guy",,,1,0
51662,43,"Segment 02: [Spanish] Consider the Following (01:35)","Blood and circulation.",0,1,34,"4 to 9","Bill Nye the science guy",,,1,0
51663,43,"Segment 03: [English] Check It Out (01:00)","Blood and circulation.",0,1,0,"4 to 9","Bill Nye the science guy",,,1,0
51664,43,"Segment 03: [Spanish] Check It Out (01:00)","Blood and circulation.",0,1,0,"4 to 9","Bill Nye the science guy",,,1,0
51665,43,"Segment 04: [English] Blood Stream Music Video (01:33)","Blood and circulation.",0,1,33,"4 to 9","Bill Nye the science guy",,,1,0
51666,43,"Segment 04: [Spanish] Blood Stream Music Video (01:33)","Blood and circulation.",0,1,34,"4 to 9","Bill Nye the science guy",,,1,0
44,44,"Bones and muscles","Bones and muscles",0,20,25,"4 to 8","Human body systems at work","Human body|Muscles|Skeleton|Human anatomy|","Visual Learning Company  Brandon  VT : c2003",1,0
11000,44,"Segment 2: Body Systems (1:14)","Bones and muscles",0,1,14,"4 to 8","Human body systems at work",,,1,0
11001,44,"Segment 5: Bone Structure (2:30)","Bones and muscles",0,2,30,"4 to 8","Human body systems at work",,,1,0
11003,44,"Segment 4: Cartilage (1:06)","Bones and muscles",0,1,6,"4 to 8","Human body systems at work",,,1,0
11004,44,"Segment 7: Muscular System (2:39)","Bones and muscles",0,2,39,"4 to 8","Human body systems at work",,,1,0
11005,44,"Segment 6: Skeletal Joints (2:45)","Bones and muscles",0,2,45,"4 to 8","Human body systems at work",,,1,0
11006,44,"Segment 3: Skeletal System (2:41)","Bones and muscles",0,2,41,"4 to 8","Human body systems at work",,,1,0
11007,44,"Segment 8: Summing Up (1:04)","Bones and muscles",0,1,4,"4 to 8","Human body systems at work",,,1,0
11008,44,"Segment 1: Tissue (1:06)","Bones and muscles",0,1,6,"4 to 8","Human body systems at work",,,1,0
11009,44,"Segment 9: Video Quiz (3:45)","Bones and muscles",0,3,45,"4 to 8","Human body systems at work",,,1,0
46,46,Buoyancy,Buoyancy,0,23,51,"3 to 8","Bill Nye the science guy",Buoyancy|Science|,"Disney Educational Productions  Elk Grove Village  IL : c1995",1,0
51676,46,"Buoyancy: Full Program: [Spanish] 4 Segments (23:00)",Buoyancy,0,23,0,"3 to 8","Bill Nye the science guy",,,1,0
51677,46,"Segment 01: [English] Displacement (01:58)",Buoyancy,0,1,58,"3 to 8","Bill Nye the science guy",,,1,0
51678,46,"Segment 01: [Spanish] Displacement (01:58)",Buoyancy,0,1,57,"3 to 8","Bill Nye the science guy",,,1,0
51679,46,"Segment 02: [English] Consider The Following (01:47)",Buoyancy,0,1,47,"3 to 8","Bill Nye the science guy",,,1,0
51680,46,"Segment 02: [Spanish] Consider The Following (01:47)",Buoyancy,0,1,47,"3 to 8","Bill Nye the science guy",,,1,0
51681,46,"Segment 03: [English] Try This (00:49)",Buoyancy,0,0,49,"3 to 8","Bill Nye the science guy",,,1,0
51682,46,"Segment 03: [Spanish] Try This (00:49)",Buoyancy,0,0,48,"3 to 8","Bill Nye the science guy",,,1,0
51683,46,"Segment 04: [English] Bills Got Boat Music Video (01:40)",Buoyancy,0,1,40,"3 to 8","Bill Nye the science guy",,,1,0
51684,46,"Segment 04: [Spanish] Bills Got Boat Music Video (01:40)",Buoyancy,0,1,41,"3 to 8","Bill Nye the science guy",,,1,0
48,48,"Charts  graphs and diagrams","Charts  graphs and diagrams",0,18,20,"0 to 3",,"Graphic methods|Charts diagrams etc|Maps|Mathematical recreations|Mathematics|Graphic methods|Study and teaching|","100% Educational Videos  El Dorado Hill  CA : c20041998",1,0
49,49,"Chemical reactions","Chemical reactions",0,23,39,"4 to 8","Bill Nye the science guy","Chemical reactions|Science|Study and teaching|Experiments|","Disney Educational Productions  Elk Grove Village  IL : c1995",1,0
51685,49,"Chemical Reactions: Full Program: [Spanish] 4 Segments (22:58)","Chemical reactions",0,23,5,"4 to 8","Bill Nye the science guy",,,1,0
51686,49,"Segment 01: [English] Check It Out (01:19)","Chemical reactions",0,1,19,"4 to 8","Bill Nye the science guy",,,1,0
51687,49,"Segment 01: [Spanish] Check It Out (01:19)","Chemical reactions",0,1,19,"4 to 8","Bill Nye the science guy",,,1,0
51688,49,"Segment 02: [English] Nifty Home Experiment (01:04)","Chemical reactions",0,1,4,"4 to 8","Bill Nye the science guy",,,1,0
51689,49,"Segment 02: [Spanish] Nifty Home Experiment (01:04)","Chemical reactions",0,1,3,"4 to 8","Bill Nye the science guy",,,1,0
51690,49,"Segment 03: [English] Consider The Following (01:19)","Chemical reactions",0,1,19,"4 to 8","Bill Nye the science guy",,,1,0
51691,49,"Segment 03: [Spanish] Consider The Following (01:19)","Chemical reactions",0,1,17,"4 to 8","Bill Nye the science guy",,,1,0
51692,49,"Segment 04: [English] Chemical Reactions Music Video (00:55)","Chemical reactions",0,0,55,"4 to 8","Bill Nye the science guy",,,1,0
51693,49,"Segment 04: [Spanish] Chemical Reactions Music Video (00:55)","Chemical reactions",0,0,54,"4 to 8","Bill Nye the science guy",,,1,0
50,50,"Circulation and respiration","Circulation and respiration",0,19,18,"6 to 8","Human body systems at work","Human body|Circulation|Human anatomy|Respiratory organs|","Visual Learning Company  Brandon  VT : c2003",1,0
11020,50,"Segment 2: Blood vessels (2:09)","Circulation and respiration",0,2,9,"6 to 8","Human body systems at work",,,1,0
11022,50,"Segment 3: Circulation in the Body (0:49)","Circulation and respiration",0,0,49,"6 to 8","Human body systems at work",,,1,0
11023,50,"Segment 1: Circulatory System (1:46)","Circulation and respiration",0,1,46,"6 to 8","Human body systems at work",,,1,0
11024,50,"Segment 5: Monitoring the Cardiovascular System (1:22)","Circulation and respiration",0,1,22,"6 to 8","Human body systems at work",,,1,0
11025,50,"Segment 7: Respiratory System (1:50)","Circulation and respiration",0,1,50,"6 to 8","Human body systems at work",,,1,0
11026,50,"Segment 8: Summing Up (1:37)","Circulation and respiration",0,1,37,"6 to 8","Human body systems at work",,,1,0
11027,50,"Segment 6: The Blood (2:13)","Circulation and respiration",0,2,13,"6 to 8","Human body systems at work",,,1,0
11028,50,"Segment 4: The Heart (1:51)","Circulation and respiration",0,1,51,"6 to 8","Human body systems at work",,,1,0
11029,50,"Segment 9: Video Quiz (3:49)","Circulation and respiration",0,3,49,"6 to 8","Human body systems at work",,,1,0
52,52,"Colonial America","Colonial America",0,10,57,"4 to 8","American history for kids","United States|West US|History|Social life and customs|Colonial period|","Landmark Media  Inc.  Falls Church  VA : c2001",0,0
56,56,"Rocks and the rock cycle","Rocks and the rock cycle",0,19,47,"0 to 14","Rocks and Minerals","Sediments Geology|Sedimentary rocks|Sedimentation and deposition|Igneous rocks|Metamorphic rocks|Mineralogy|Rocks|","Visual Learning Company  Brandon  VT : c2005",1,0
11207,56,"Segment 08: Complexities of the Rock Cycle (1:19)","Rocks and the rock cycle",0,1,19,"0 to 14","Rocks and Minerals",,,1,0
11208,56,"Segment 03: Igneous Rocks (1:30)","Rocks and the rock cycle",0,1,29,"0 to 14","Rocks and Minerals",,,1,0
11209,56,"Segment 05: Metamorphic Rocks (1:34)","Rocks and the rock cycle",0,1,34,"0 to 14","Rocks and Minerals",,,1,0
11211,56,"Segment 04: Sedimentary Rocks (1:50)","Rocks and the rock cycle",0,1,49,"0 to 14","Rocks and Minerals",,,1,0
11212,56,"Segment 09: Summing Up (0:53)","Rocks and the rock cycle",0,0,52,"0 to 14","Rocks and Minerals",,,1,0
11213,56,"Segment 07: The Rock Cycle (2:53)","Rocks and the rock cycle",0,2,53,"0 to 14","Rocks and Minerals",,,1,0
11214,56,"Segment 10: Video Quiz (3:27)","Rocks and the rock cycle",0,3,26,"0 to 14","Rocks and Minerals",,,1,0
11215,56,"Segment 06: Weathering and Erosion (2:01)","Rocks and the rock cycle",0,2,1,"0 to 14","Rocks and Minerals",,,1,0
11216,56,"Segment 01: What are Rocks Made Of? (1:20)","Rocks and the rock cycle",0,1,20,"0 to 14","Rocks and Minerals",,,1,0
11217,56,"Segment 02: What is a rock? (1:02)","Rocks and the rock cycle",0,1,2,"0 to 14","Rocks and Minerals",,,1,0
59,59,"Digestion and excretion","Digestion and excretion",0,19,28,"4 to 8","Human body systems at work","Human body|Digestion|Digestive organs|Excretory organs|Human anatomy|","Visual Learning Company  Brandon  VT : c2003",1,0
11097,59,"Segment 3: Digestion of Food (3:44)","Digestion and excretion",0,3,44,"4 to 8","Human body systems at work",,,1,0
11098,59,"Segment 1: Nutrition (1:06)","Digestion and excretion",0,1,6,"4 to 8","Human body systems at work",,,1,0
11099,59,"Segment 5: Summing Up (1:31)","Digestion and excretion",0,1,31,"4 to 8","Human body systems at work",,,1,0
11100,59,"Segment 4: The Excretory System (3:07)","Digestion and excretion",0,3,7,"4 to 8","Human body systems at work",,,1,0
11101,59,"Segment 2: Types of Nutrients (4:20)","Digestion and excretion",0,4,20,"4 to 8","Human body systems at work",,,1,0
11102,59,"Segment 6: Video Quiz (3:55)","Digestion and excretion",0,3,55,"4 to 8","Human body systems at work",,,1,0